Reaction Details
TargetMitogen-activated protein kinase 14
LigandBDBM142598
Substrate/Competitorn/a
Meas. Tech.p38 MAPKalpha Enzyme Inhibition
Kd 1.000±n/a nM
Citation Ito, KCharron, CEKing-Underwood, JOnions, STLongshaw, AI 1-pyrazolyl-3-(4-((2-anilinopyrimidin-4-yl) oxy) napththalen-1-yl) ureas as p38 MAP kinase inhibitors US Patent US10238658 Publication Date 3/26/2019
 
Mitogen-activated protein kinase 14
Name:Mitogen-activated protein kinase 14
Type:Serine/threonine-protein kinase
Mol. Mass.:41286.76
Organism:Homo sapiens (Human)
Description:Q16539
Residue:360
BDBM142598
NameBDBM142598
Synonyms:US10238658, Example Reference US8933228, Ref 2 US9249125, Reference Compound US9724347, Example Reference | US9993478, Example Reference
TypeSmall organic molecule
Emp. Form.C33H34N6O4
Mol. Mass.578.6609
SMILESCOCC(=O)Nc1cc(Oc2ccc(NC(=O)Nc3cc(nn3-c3ccc(C)cc3)C(C)(C)C)c3ccccc23)ccn1