Reaction Details
TargetMonocarboxylate transporter 1
LigandBDBM22015
Substrate/CompetitorBDBM21986
Meas. Tech.Radioligand Filter Binding Assay
pH7.8±n/a
Temperature295.15±n/a K
Ki 4.9±n/a nM
Citation Guile, SDBantick, JRCheshire, DRCooper, MEDavis, AMDonald, DKEvans, REyssade, CFerguson, DDHill, SHutchinson, RIngall, AHKingston, LPMartin, IMartin, BPMohammed, RTMurray, CPerry, MWReynolds, RHThorne, PVWilkinson, DJWithnall, J Potent blockers of the monocarboxylate transporter MCT1: novel immunomodulatory compounds. Bioorg Med Chem Lett16:2260-5 (2006) 
 
Monocarboxylate transporter 1
Name:Monocarboxylate transporter 1
Type:PROTEIN
Mol. Mass.:53956.64
Organism:Homo sapiens (Human)
Description:ChEMBL_1451367
Residue:500
BDBM22015
BDBM21986
NameBDBM22015
Synonyms:5-{[(3R)-3-hydroxypyrrolidin-1-yl]carbonyl}-3-methyl-1-(2-methylpropyl)-6-{[2-(trifluoromethyl)phenyl]methyl}-1H,2H,3H,4H-thieno[2,3-d]pyrimidine-2,4-dione | Thieno[2,3-d]pyrimidine-2,4(1H,3H)-dione, 22
TypeSmall organic molecule
Emp. Form.C24H26F3N3O4S
Mol. Mass.509.541
SMILESCC(C)Cn1c2sc(Cc3ccccc3C(F)(F)F)c(C(=O)N3CC[C@@H](O)C3)c2c(=O)n(C)c1=O