Reaction Details
TargetCathepsin B-like cysteine protease
LigandBDBM22099
Substrate/CompetitorBDBM22047
Meas. Tech.Enzyme Inhibition Assay
Temperature298.15±n/a K
IC50 930±n/a nM
Commentsextracted
Citation Mallari, JPShelat, AAObrien, TCaffrey, CRKosinski, AConnelly, MHarbut, MGreenbaum, DMcKerrow, JHGuy, RK Development of potent purine-derived nitrile inhibitors of the trypanosomal protease TbcatB. J Med Chem51:545-52 (2008) 
 
Cathepsin B-like cysteine protease
Name:Cathepsin B-like cysteine protease
Type:Enzyme
Mol. Mass.:37220.37
Organism:Trypanosoma brucei
Description:Enzyme was expressed in yeast Pichia pastoris.
Residue:340
BDBM22099
BDBM22047
NameBDBM22099
Synonyms:6-{[(3,4-dichlorophenyl)methyl]amino}-9-(5-hydroxypentyl)-9H-purine-2-carbonitrile | Compound 3{12,4}
TypeSmall organic molecule
Emp. Form.C18H18Cl2N6O
Mol. Mass.405.281
SMILESOCCCCCn1cnc2c(NCc3ccc(Cl)c(Cl)c3)nc(nc12)C#N