Reaction Details
TargetPolyunsaturated fatty acid lipoxygenase ALOX15
LigandBDBM22295
Substrate/CompetitorBDBM22231
Meas. Tech.Enzyme Inhibition Assay
IC50 27±n/a nM
Citation Weinstein, DSLiu, WGu, ZLangevine, CNgu, KFadnis, LCombs, DWSitkoff, DAhmad, SZhuang, SChen, XWang, FLLoughney, DAAtwal, KSZahler, RMacor, JEMadsen, CSMurugesan, N Tryptamine and homotryptamine-based sulfonamides as potent and selective inhibitors of 15-lipoxygenase. Bioorg Med Chem Lett15:1435-40 (2005) 
 
Polyunsaturated fatty acid lipoxygenase ALOX15
Name:Polyunsaturated fatty acid lipoxygenase ALOX15
Type:Enzyme
Mol. Mass.:75309.71
Organism:Oryctolagus cuniculus (rabbit)
Description:15-LO enzyme was purified from phenylhydrazine treated rabbits.
Residue:663
BDBM22295
BDBM22231
NameBDBM22295
Synonyms:N-{2-[2-(4-methoxyphenyl)-1H-indol-3-yl]ethyl}-4-phenylbenzene-1-sulfonamide | tryptamine sulfonamide, 37e
TypeSmall organic molecule
Emp. Form.C29H26N2O3S
Mol. Mass.482.593
SMILESCOc1ccc(cc1)-c1[nH]c2ccccc2c1CCNS(=O)(=O)c1ccc(cc1)-c1ccccc1