Reaction Details
TargetPolyunsaturated fatty acid lipoxygenase ALOX15
LigandBDBM22297
Substrate/CompetitorBDBM22231
Meas. Tech.Enzyme Inhibition Assay
IC50 25±n/a nM
Citation Weinstein, DSLiu, WGu, ZLangevine, CNgu, KFadnis, LCombs, DWSitkoff, DAhmad, SZhuang, SChen, XWang, FLLoughney, DAAtwal, KSZahler, RMacor, JEMadsen, CSMurugesan, N Tryptamine and homotryptamine-based sulfonamides as potent and selective inhibitors of 15-lipoxygenase. Bioorg Med Chem Lett15:1435-40 (2005) 
 
Polyunsaturated fatty acid lipoxygenase ALOX15
Name:Polyunsaturated fatty acid lipoxygenase ALOX15
Type:Enzyme
Mol. Mass.:75309.71
Organism:Oryctolagus cuniculus (rabbit)
Description:15-LO enzyme was purified from phenylhydrazine treated rabbits.
Residue:663
BDBM22297
BDBM22231
NameBDBM22297
Synonyms:N-{2-[2-(3-methylphenyl)-1H-indol-3-yl]ethyl}-4-pentylbenzene-1-sulfonamide | tryptamine sulfonamide, 37g
TypeSmall organic molecule
Emp. Form.C28H32N2O2S
Mol. Mass.460.631
SMILESCCCCCc1ccc(cc1)S(=O)(=O)NCCc1c([nH]c2ccccc12)-c1cccc(C)c1