Reaction Details
TargetPolyunsaturated fatty acid lipoxygenase ALOX15
LigandBDBM22298
Substrate/CompetitorBDBM22231
Meas. Tech.Enzyme Inhibition Assay
IC50 32±n/a nM
Citation Weinstein, DSLiu, WGu, ZLangevine, CNgu, KFadnis, LCombs, DWSitkoff, DAhmad, SZhuang, SChen, XWang, FLLoughney, DAAtwal, KSZahler, RMacor, JEMadsen, CSMurugesan, N Tryptamine and homotryptamine-based sulfonamides as potent and selective inhibitors of 15-lipoxygenase. Bioorg Med Chem Lett15:1435-40 (2005) 
 
Polyunsaturated fatty acid lipoxygenase ALOX15
Name:Polyunsaturated fatty acid lipoxygenase ALOX15
Type:Enzyme
Mol. Mass.:75309.71
Organism:Oryctolagus cuniculus (rabbit)
Description:15-LO enzyme was purified from phenylhydrazine treated rabbits.
Residue:663
BDBM22298
BDBM22231
NameBDBM22298
Synonyms:N-{2-[2-(4-chlorophenyl)-1H-indol-3-yl]ethyl}-4-pentylbenzene-1-sulfonamide | tryptamine sulfonamide, 37h
TypeSmall organic molecule
Emp. Form.C27H29ClN2O2S
Mol. Mass.481.049
SMILESCCCCCc1ccc(cc1)S(=O)(=O)NCCc1c([nH]c2ccccc12)-c1ccc(Cl)cc1