Reaction Details
TargetPolyunsaturated fatty acid lipoxygenase ALOX15
LigandBDBM22300
Substrate/CompetitorBDBM22231
Meas. Tech.Enzyme Inhibition Assay
IC50 11±n/a nM
Citation Weinstein, DSLiu, WGu, ZLangevine, CNgu, KFadnis, LCombs, DWSitkoff, DAhmad, SZhuang, SChen, XWang, FLLoughney, DAAtwal, KSZahler, RMacor, JEMadsen, CSMurugesan, N Tryptamine and homotryptamine-based sulfonamides as potent and selective inhibitors of 15-lipoxygenase. Bioorg Med Chem Lett15:1435-40 (2005) 
 
Polyunsaturated fatty acid lipoxygenase ALOX15
Name:Polyunsaturated fatty acid lipoxygenase ALOX15
Type:Enzyme
Mol. Mass.:75309.71
Organism:Oryctolagus cuniculus (rabbit)
Description:15-LO enzyme was purified from phenylhydrazine treated rabbits.
Residue:663
BDBM22300
BDBM22231
NameBDBM22300
Synonyms:4-pentyl-N-(2-{2-[4-(trifluoromethyl)phenyl]-1H-indol-3-yl}ethyl)benzene-1-sulfonamide | tryptamine sulfonamide, 37j
TypeSmall organic molecule
Emp. Form.C28H29F3N2O2S
Mol. Mass.514.602
SMILESCCCCCc1ccc(cc1)S(=O)(=O)NCCc1c([nH]c2ccccc12)-c1ccc(cc1)C(F)(F)F