Reaction Details
TargetPolyunsaturated fatty acid lipoxygenase ALOX15
LigandBDBM22304
Substrate/CompetitorBDBM22231
Meas. Tech.Enzyme Inhibition Assay
IC50 8±n/a nM
Citation Weinstein, DSLiu, WGu, ZLangevine, CNgu, KFadnis, LCombs, DWSitkoff, DAhmad, SZhuang, SChen, XWang, FLLoughney, DAAtwal, KSZahler, RMacor, JEMadsen, CSMurugesan, N Tryptamine and homotryptamine-based sulfonamides as potent and selective inhibitors of 15-lipoxygenase. Bioorg Med Chem Lett15:1435-40 (2005) 
 
Polyunsaturated fatty acid lipoxygenase ALOX15
Name:Polyunsaturated fatty acid lipoxygenase ALOX15
Type:Enzyme
Mol. Mass.:75309.71
Organism:Oryctolagus cuniculus (rabbit)
Description:15-LO enzyme was purified from phenylhydrazine treated rabbits.
Residue:663
BDBM22304
BDBM22231
NameBDBM22304
Synonyms:N-{3-[2-(1-benzofuran-2-yl)-1H-indol-3-yl]propyl}-4-phenylbenzene-1-sulfonamide | homotryptamine sulfonamide, 37n
TypeSmall organic molecule
Emp. Form.C31H26N2O3S
Mol. Mass.506.615
SMILESO=S(=O)(NCCCc1c([nH]c2ccccc12)-c1cc2ccccc2o1)c1ccc(cc1)-c1ccccc1