Reaction Details
TargetPolyunsaturated fatty acid lipoxygenase ALOX15
LigandBDBM22306
Substrate/CompetitorBDBM22231
Meas. Tech.Enzyme Inhibition Assay
IC50 13±n/a nM
Citation Weinstein, DSLiu, WGu, ZLangevine, CNgu, KFadnis, LCombs, DWSitkoff, DAhmad, SZhuang, SChen, XWang, FLLoughney, DAAtwal, KSZahler, RMacor, JEMadsen, CSMurugesan, N Tryptamine and homotryptamine-based sulfonamides as potent and selective inhibitors of 15-lipoxygenase. Bioorg Med Chem Lett15:1435-40 (2005) 
 
Polyunsaturated fatty acid lipoxygenase ALOX15
Name:Polyunsaturated fatty acid lipoxygenase ALOX15
Type:Enzyme
Mol. Mass.:75309.71
Organism:Oryctolagus cuniculus (rabbit)
Description:15-LO enzyme was purified from phenylhydrazine treated rabbits.
Residue:663
BDBM22306
BDBM22231
NameBDBM22306
Synonyms:4-pentyl-N-{2-[2-(quinolin-3-yl)-1H-indol-3-yl]ethyl}benzene-1-sulfonamide | tryptamine sulfonamide, 37p
TypeSmall organic molecule
Emp. Form.C30H31N3O2S
Mol. Mass.497.651
SMILESCCCCCc1ccc(cc1)S(=O)(=O)NCCc1c([nH]c2ccccc12)-c1cnc2ccccc2c1