Reaction Details
TargetPolyunsaturated fatty acid lipoxygenase ALOX15
LigandBDBM22311
Substrate/CompetitorBDBM22231
Meas. Tech.Enzyme Inhibition Assay
IC50 15±n/a nM
Citation Weinstein, DSLiu, WGu, ZLangevine, CNgu, KFadnis, LCombs, DWSitkoff, DAhmad, SZhuang, SChen, XWang, FLLoughney, DAAtwal, KSZahler, RMacor, JEMadsen, CSMurugesan, N Tryptamine and homotryptamine-based sulfonamides as potent and selective inhibitors of 15-lipoxygenase. Bioorg Med Chem Lett15:1435-40 (2005) 
 
Polyunsaturated fatty acid lipoxygenase ALOX15
Name:Polyunsaturated fatty acid lipoxygenase ALOX15
Type:Enzyme
Mol. Mass.:75309.71
Organism:Oryctolagus cuniculus (rabbit)
Description:15-LO enzyme was purified from phenylhydrazine treated rabbits.
Residue:663
BDBM22311
BDBM22231
NameBDBM22311
Synonyms:4-({2-[2-(1-benzofuran-2-yl)-1H-indol-3-yl]ethyl}sulfamoyl)-N-phenylbenzamide | tryptamine sulfonamide, 40d
TypeSmall organic molecule
Emp. Form.C31H25N3O4S
Mol. Mass.535.613
SMILESO=C(Nc1ccccc1)c1ccc(cc1)S(=O)(=O)NCCc1c([nH]c2ccccc12)-c1cc2ccccc2o1