Reaction Details
TargetPolyunsaturated fatty acid lipoxygenase ALOX15
LigandBDBM22312
Substrate/CompetitorBDBM22231
Meas. Tech.Enzyme Inhibition Assay
IC50 11±n/a nM
Citation Weinstein, DSLiu, WGu, ZLangevine, CNgu, KFadnis, LCombs, DWSitkoff, DAhmad, SZhuang, SChen, XWang, FLLoughney, DAAtwal, KSZahler, RMacor, JEMadsen, CSMurugesan, N Tryptamine and homotryptamine-based sulfonamides as potent and selective inhibitors of 15-lipoxygenase. Bioorg Med Chem Lett15:1435-40 (2005) 
 
Polyunsaturated fatty acid lipoxygenase ALOX15
Name:Polyunsaturated fatty acid lipoxygenase ALOX15
Type:Enzyme
Mol. Mass.:75309.71
Organism:Oryctolagus cuniculus (rabbit)
Description:15-LO enzyme was purified from phenylhydrazine treated rabbits.
Residue:663
BDBM22312
BDBM22231
NameBDBM22312
Synonyms:4-({2-[2-(1-benzofuran-2-yl)-1H-indol-3-yl]ethyl}sulfamoyl)-N-(4-methoxyphenyl)benzamide | tryptamine sulfonamide, 40e
TypeSmall organic molecule
Emp. Form.C32H27N3O5S
Mol. Mass.565.639
SMILESCOc1ccc(NC(=O)c2ccc(cc2)S(=O)(=O)NCCc2c([nH]c3ccccc23)-c2cc3ccccc3o2)cc1