Reaction Details
Target11-beta-hydroxysteroid dehydrogenase 1
LigandBDBM22471
Substrate/CompetitorBDBM13739
Meas. Tech.Human 11beta-HSD1 Scintillation Proximity Assay (SPA)
pH7.2±n/a
Temperature295.15±n/a K
Ki 14±3 nM
Citation Johansson, LFotsch, CBartberger, MDCastro, VMChen, MEmery, MGustafsson, SHale, CHickman, DHoman, EJordan, SRKomorowski, RLi, AMcRae, KMoniz, GMatsumoto, GOrihuela, CPalm, GVeniant, MWang, MWilliams, MZhang, J 2-Amino-1,3-thiazol-4(5H)-ones as Potent and Selective 11beta-Hydroxysteroid Dehydrogenase Type 1 Inhibitors: Enzyme-Ligand Co-Crystal Structure and Demonstration of Pharmacodynamic Effects in C57Bl/6 Mice. J Med Chem51:2933-43 (2008) 
 
11-beta-hydroxysteroid dehydrogenase 1
Name:11-beta-hydroxysteroid dehydrogenase 1
Type:Enzyme
Mol. Mass.:32409.16
Organism:Homo sapiens (Human)
Description:P28845
Residue:292
BDBM22471
BDBM13739
NameBDBM22471
Synonyms:2-(cyclooctylamino)-1-thia-3-azaspiro[4.4]non-2-en-4-one | 2-Amino-1,3-thiazol-4(5H)-one, 8a
TypeSmall organic molecule
Emp. Form.C15H24N2OS
Mol. Mass.280.429
SMILESO=C1N=C(NC2CCCCCCC2)SC11CCCC1