Reaction Details
Target11-beta-hydroxysteroid dehydrogenase type 2
LigandBDBM22456
Substrate/CompetitorBDBM13775
Meas. Tech.Human 11beta-HSD1 Scintillation Proximity Assay (SPA)
IC50>10000±n/a nM
Citation Johansson, LFotsch, CBartberger, MDCastro, VMChen, MEmery, MGustafsson, SHale, CHickman, DHoman, EJordan, SRKomorowski, RLi, AMcRae, KMoniz, GMatsumoto, GOrihuela, CPalm, GVeniant, MWang, MWilliams, MZhang, J 2-Amino-1,3-thiazol-4(5H)-ones as Potent and Selective 11beta-Hydroxysteroid Dehydrogenase Type 1 Inhibitors: Enzyme-Ligand Co-Crystal Structure and Demonstration of Pharmacodynamic Effects in C57Bl/6 Mice. J Med Chem51:2933-43 (2008) 
 
11-beta-hydroxysteroid dehydrogenase type 2
Name:11-beta-hydroxysteroid dehydrogenase type 2
Type:Enzyme
Mol. Mass.:44141.72
Organism:Homo sapiens (Human)
Description:Purified recombinant human 11beta-HSD2.
Residue:405
BDBM22456
BDBM13775
NameBDBM22456
Synonyms:2-(cycloheptylamino)-5-ethyl-5-methyl-4,5-dihydro-1,3-thiazol-4-one | 2-Amino-1,3-thiazol-4(5H)-one, 5c
TypeSmall organic molecule
Emp. Form.C13H22N2OS
Mol. Mass.254.392
SMILESCCC1(C)SC(NC2CCCCCC2)=NC1=O