Reaction Details
TargetLysine-specific demethylase 2A
LigandBDBM276044
Substrate/Competitorn/a
Meas. Tech.FBXL11 Assay
IC50<100±n/a nM
Citation Chen, YKNie, ZStafford, JAVeal, JM Histone demethylase inhibitors US Patent US9896436 Publication Date 2/20/2018
 
Lysine-specific demethylase 2A
Name:Lysine-specific demethylase 2A
Type:Enzyme Catalytic Domain
Mol. Mass.:132809.04
Organism:Homo sapiens (Human)
Description:n/a
Residue:1162
BDBM276044
NameBDBM276044
Synonyms:2-[1-[2-(2-chlorophenyl)ethyl]imidazol-4-yl]-4-(1H-triazol-4-yl)pyridine US10174003, Example 6 | US9896436, Example 6
TypeSmall organic molecule
Emp. Form.C18H15ClN6
Mol. Mass.350.805
SMILESClc1ccccc1CCn1cnc(c1)-c1cc(ccn1)-c1c[nH]nn1