Reaction Details
TargetHistamine H4 receptor
LigandBDBM22548
Substrate/CompetitorBDBM7966
Meas. Tech.H4R Radioligand Binding Assay
pH7.4±n/a
Temperature298.15±n/a K
Ki 8±1 nM
Citation Wijtmans, MCelanire, SSnip, EGillard, MRGelens, ECollart, PPVenhuis, BJChristophe, BHulscher, Svan der Goot, HLebon, FTimmerman, HBakker, RALallemand, BILeurs, RTalaga, PEde Esch, IJ 4-benzyl-1H-imidazoles with oxazoline termini as histamine H3 receptor agonists. J Med Chem51:2944-53 (2008) 
 
Histamine H4 receptor
Name:Histamine H4 receptor
Type:G Protein-Coupled Receptor (GPCR)
Mol. Mass.:44517.02
Organism:Homo sapiens (Human)
Description:Binding assays were using CHO cells stably expressing hH4R receptors.
Residue:390
BDBM22548
BDBM7966
NameBDBM22548
Synonyms:2-[3-(1H-imidazol-4-ylmethyl)phenyl]-4,4,6-trimethyl-5,6-dihydro-4H-1,3-oxazine | 4-Benzyl-1H-imidazole derivative, 26
TypeSmall organic molecule
Emp. Form.C17H21N3O
Mol. Mass.283.3681
SMILESCC1CC(C)(C)N=C(O1)c1cccc(Cc2cnc[nH]2)c1