Reaction Details
TargetPhosphoribosylglycinamide formyltransferase
LigandBDBM22587
Substrate/CompetitorBDBM22589
Meas. Tech.GAR Tfase Activity Assay
pH7.5±n/a
Temperature299.15±n/a K
Ki>100000±n/a nM
Citation Xu, LChong, YHwang, ID'Onofrio, AAmore, KBeardsley, GPLi, COlson, AJBoger, DLWilson, IA Structure-based design, synthesis, evaluation, and crystal structures of transition state analogue inhibitors of inosine monophosphate cyclohydrolase. J Biol Chem282:13033-46 (2007) 
 
Phosphoribosylglycinamide formyltransferase
Name:Phosphoribosylglycinamide formyltransferase
Type:Enzyme
Mol. Mass.:23233.97
Organism:Escherichia coli (strain K12)
Description:n/a
Residue:212
BDBM22587
BDBM22589
NameBDBM22587
Synonyms:7-[(2R,3R,4S,5R)-3,4-dihydroxy-5-(hydroxymethyl)oxolan-2-yl]-1H,3H,4H,7H-2,1,3,5,7-imidazo[4,5-c][1,2,6]thiadiazine-2,2,4-trione | Nucleoside, 2
TypeNucleoside or nucleotide
Emp. Form.C9H12N4O7S
Mol. Mass.320.279
SMILESOC[C@H]1O[C@H]([C@H](O)[C@@H]1O)n1cnc2c1NS(=O)(=O)NC2=O