Reaction Details
TargetCoagulation factor XII
LigandBDBM22799
Substrate/CompetitorBDBM22723
Meas. Tech.Enzyme Inhibition Assay
pH7.4±n/a
Temperature298.15±n/a K
Ki 410±60 nM
Citation Hyatt, JLMoak, THatfield, MJTsurkan, LEdwards, CCWierdl, MDanks, MKWadkins, RMPotter, PM Selective inhibition of carboxylesterases by isatins, indole-2,3-diones. J Med Chem50:1876-85 (2007) 
 
Coagulation factor XII
Name:Coagulation factor XII
Type:Enzyme
Mol. Mass.:67810.07
Organism:Homo sapiens (Human)
Description:P00748
Residue:615
BDBM22799
BDBM22723
NameBDBM22799
Synonyms:1-{[(4-ethylphenyl)amino]methyl}-2,3-dihydro-1H-indole-2,3-dione | Isatin-based compound, 19
TypeSmall organic molecule
Emp. Form.C17H16N2O2
Mol. Mass.280.3211
SMILESCCc1ccc(NCN2C(=O)C(=O)c3ccccc23)cc1