Reaction Details
TargetCoagulation factor XII
LigandBDBM22802
Substrate/CompetitorBDBM22723
Meas. Tech.Enzyme Inhibition Assay
pH7.4±n/a
Temperature298.15±n/a K
Ki 110±30 nM
Citation Hyatt, JLMoak, THatfield, MJTsurkan, LEdwards, CCWierdl, MDanks, MKWadkins, RMPotter, PM Selective inhibition of carboxylesterases by isatins, indole-2,3-diones. J Med Chem50:1876-85 (2007) 
 
Coagulation factor XII
Name:Coagulation factor XII
Type:Enzyme
Mol. Mass.:67810.07
Organism:Homo sapiens (Human)
Description:P00748
Residue:615
BDBM22802
BDBM22723
NameBDBM22802
Synonyms:1-[(naphthalen-2-ylamino)methyl]-2,3-dihydro-1H-indole-2,3-dione | Isatin-based compound, 22
TypeSmall organic molecule
Emp. Form.C19H14N2O2
Mol. Mass.302.3267
SMILESO=C1N(CNc2ccc3ccccc3c2)c2ccccc2C1=O