Reaction Details
TargetCoagulation factor XII
LigandBDBM22818
Substrate/CompetitorBDBM22723
Meas. Tech.Enzyme Inhibition Assay
Ki 280±n/a nM
Citation Hyatt, JLMoak, THatfield, MJTsurkan, LEdwards, CCWierdl, MDanks, MKWadkins, RMPotter, PM Selective inhibition of carboxylesterases by isatins, indole-2,3-diones. J Med Chem50:1876-85 (2007) 
 
Coagulation factor XII
Name:Coagulation factor XII
Type:Enzyme
Mol. Mass.:67810.07
Organism:Homo sapiens (Human)
Description:P00748
Residue:615
BDBM22818
BDBM22723
NameBDBM22818
Synonyms:5-bromo-1-(2-methylprop-2-en-1-yl)-2,3-dihydro-1H-indole-2,3-dione | Isatin-based compound, 38
TypeSmall organic molecule
Emp. Form.C12H10BrNO2
Mol. Mass.280.117
SMILESCC(=C)CN1C(=O)C(=O)c2cc(Br)ccc12