Reaction Details
TargetLiver carboxylesterase 1
LigandBDBM22829
Substrate/CompetitorBDBM22723
Meas. Tech.Enzyme Inhibition Assay
Ki 410±n/a nM
Citation Hyatt, JLMoak, THatfield, MJTsurkan, LEdwards, CCWierdl, MDanks, MKWadkins, RMPotter, PM Selective inhibition of carboxylesterases by isatins, indole-2,3-diones. J Med Chem50:1876-85 (2007) 
 
Liver carboxylesterase 1
Name:Liver carboxylesterase 1
Type:Enzyme
Mol. Mass.:62292
Organism:Oryctolagus cuniculus (rabbit)
Description:n/a
Residue:565
BDBM22829
BDBM22723
NameBDBM22829
Synonyms:4,5-dichloro-2,3-dihydro-1H-indole-2,3-dione | Isatin-based compound, 49
TypeSmall organic molecule
Emp. Form.C8H3Cl2NO2
Mol. Mass.216.021
SMILESClc1ccc2NC(=O)C(=O)c2c1Cl