Reaction Details
TargetLiver carboxylesterase 1
LigandBDBM22830
Substrate/CompetitorBDBM22723
Meas. Tech.Enzyme Inhibition Assay
Ki 530±n/a nM
Citation Hyatt, JLMoak, THatfield, MJTsurkan, LEdwards, CCWierdl, MDanks, MKWadkins, RMPotter, PM Selective inhibition of carboxylesterases by isatins, indole-2,3-diones. J Med Chem50:1876-85 (2007) 
 
Liver carboxylesterase 1
Name:Liver carboxylesterase 1
Type:Enzyme
Mol. Mass.:62292
Organism:Oryctolagus cuniculus (rabbit)
Description:n/a
Residue:565
BDBM22830
BDBM22723
NameBDBM22830
Synonyms:4,6-dichloro-2,3-dihydro-1H-indole-2,3-dione | Isatin-based compound, 50
TypeSmall organic molecule
Emp. Form.C8H3Cl2NO2
Mol. Mass.216.021
SMILESClc1cc2NC(=O)C(=O)c2c(Cl)c1