Reaction Details
TargetCoagulation factor XII
LigandBDBM22843
Substrate/CompetitorBDBM22723
Meas. Tech.Enzyme Inhibition Assay
Ki 11±n/a nM
Citation Hyatt, JLMoak, THatfield, MJTsurkan, LEdwards, CCWierdl, MDanks, MKWadkins, RMPotter, PM Selective inhibition of carboxylesterases by isatins, indole-2,3-diones. J Med Chem50:1876-85 (2007) 
 
Coagulation factor XII
Name:Coagulation factor XII
Type:Enzyme
Mol. Mass.:67810.07
Organism:Homo sapiens (Human)
Description:P00748
Residue:615
BDBM22843
BDBM22723
NameBDBM22843
Synonyms:1-hexadecyl-2,3-dihydro-1H-indole-2,3-dione | Isatin-based compound, 63
TypeSmall organic molecule
Emp. Form.C24H37NO2
Mol. Mass.371.5561
1C(=O)C(=O)c2ccccc12