Reaction Details
TargetSodium channel protein type 8 subunit alpha
LigandBDBM373891
Substrate/Competitorn/a
Meas. Tech.Sodium Influx Assay (In Vitro Assay)
IC50 9.00±n/a nM
Citation Andrez, JBurford, KNChowdhury, SCohen, CJDehnhardt, CMDevita, RJEmpfield, JRFocken, TGrimwood, MEHasan, SAJohnson, Jr., JPZenova, AY Benzenesulfonamide compounds and their use as therapeutic agents US Patent US10246453 Publication Date 4/2/2019
 
Sodium channel protein type 8 subunit alpha
Name:Sodium channel protein type 8 subunit alpha
Type:PROTEIN
Mol. Mass.:225271.59
Organism:Homo sapiens (Human)
Description:ChEMBL_1516902
Residue:1980
BDBM373891
NameBDBM373891
Synonyms:(S)-4-((1-benzyl-3-methylpyrrolidin-3-yl)oxy)-2,6-difluoro-3-methyl-N-(thiazol-4-yl)benzenesulfonamide formate US10662184, Example 158 US11299490, Example 158
TypeSmall organic molecule
Emp. Form.C22H23F2N3O3S2
Mol. Mass.479.563
SMILESCc1c(F)c(c(F)cc1O[C@@]1(C)CCN(Cc2ccccc2)C1)S(=O)(=O)Nc1cscn1