Reaction Details
TargetSodium channel protein type 8 subunit alpha
LigandBDBM373961
Substrate/Competitorn/a
Meas. Tech.Sodium Influx Assay (In Vitro Assay)
IC50 31.0±n/a nM
Citation Andrez, JBurford, KNChowdhury, SCohen, CJDehnhardt, CMDevita, RJEmpfield, JRFocken, TGrimwood, MEHasan, SAJohnson, Jr., JPZenova, AY Benzenesulfonamide compounds and their use as therapeutic agents US Patent US10246453 Publication Date 4/2/2019
 
Sodium channel protein type 8 subunit alpha
Name:Sodium channel protein type 8 subunit alpha
Type:PROTEIN
Mol. Mass.:225271.59
Organism:Homo sapiens (Human)
Description:ChEMBL_1516902
Residue:1980
BDBM373961
NameBDBM373961
Synonyms:US10246453, Example 228 rac-4-((1-benzyl-3-methylpyrrolidin-3-yl)oxy)-2,6-difluoro-3-methyl-N-(thiazol-2-yl)benzenesulfonamide 2,2,2-trifluoroacetate
TypeSmall organic molecule
Emp. Form.C22H23F2N3O3S2
Mol. Mass.479.563
SMILESCc1c(F)c(c(F)cc1OC1(C)CCN(Cc2ccccc2)C1)S(=O)(=O)Nc1nccs1