Reaction Details
TargetSodium channel protein type 8 subunit alpha
LigandBDBM374000
Substrate/Competitorn/a
Meas. Tech.Electrophysiological Assay (In Vitro Assay)
IC50 66.0±n/a nM
Citation Andrez, JBurford, KNChowdhury, SCohen, CJDehnhardt, CMDevita, RJEmpfield, JRFocken, TGrimwood, MEHasan, SAJohnson, Jr., JPZenova, AY Benzenesulfonamide compounds and their use as therapeutic agents US Patent US10246453 Publication Date 4/2/2019
 
Sodium channel protein type 8 subunit alpha
Name:Sodium channel protein type 8 subunit alpha
Type:PROTEIN
Mol. Mass.:225271.59
Organism:Homo sapiens (Human)
Description:ChEMBL_1516902
Residue:1980
BDBM374000
NameBDBM374000
Synonyms:(S)-3-chloro-2,6-difluoro-4-(methyl(1-((6-methylpyridin-2-yl)methyl)pyrrolidin-3-yl)amino)-N-(thiazol-4-yl)benzenesulfonamide US10662184, Example 267 US11299490, Example 267
TypeSmall organic molecule
Emp. Form.C21H22ClF2N5O2S2
Mol. Mass.514.011
SMILESCN([C@H]1CCN(Cc2cccc(C)n2)C1)c1cc(F)c(c(F)c1Cl)S(=O)(=O)Nc1cscn1