Reaction Details
TargetSodium channel protein type 8 subunit alpha
LigandBDBM374010
Substrate/Competitorn/a
Meas. Tech.Electrophysiological Assay (In Vitro Assay)
IC50 27.0±n/a nM
Citation Andrez, JBurford, KNChowdhury, SCohen, CJDehnhardt, CMDevita, RJEmpfield, JRFocken, TGrimwood, MEHasan, SAJohnson, Jr., JPZenova, AY Benzenesulfonamide compounds and their use as therapeutic agents US Patent US10246453 Publication Date 4/2/2019
 
Sodium channel protein type 8 subunit alpha
Name:Sodium channel protein type 8 subunit alpha
Type:PROTEIN
Mol. Mass.:225271.59
Organism:Homo sapiens (Human)
Description:ChEMBL_1516902
Residue:1980
BDBM374010
NameBDBM374010
Synonyms:(S)-4-((1-benzylpyrrolidin-3-yl)(methyl)amino)-2-fluoro-N-(isothiazol-3-yl)-5-methylbenzenesulfonamide 2,2,2-trifluoroacetate US10662184, Example 277 US11299490, Example 277
TypeSmall organic molecule
Emp. Form.C22H25FN4O2S2
Mol. Mass.460.588
SMILESCN([C@H]1CCN(Cc2ccccc2)C1)c1cc(F)c(cc1C)S(=O)(=O)Nc1ccsn1