Reaction Details
TargetSodium channel protein type 8 subunit alpha
LigandBDBM374015
Substrate/Competitorn/a
Meas. Tech.Electrophysiological Assay (In Vitro Assay)
IC50 5.00±n/a nM
Citation Andrez, JBurford, KNChowdhury, SCohen, CJDehnhardt, CMDevita, RJEmpfield, JRFocken, TGrimwood, MEHasan, SAJohnson, Jr., JPZenova, AY Benzenesulfonamide compounds and their use as therapeutic agents US Patent US10246453 Publication Date 4/2/2019
 
Sodium channel protein type 8 subunit alpha
Name:Sodium channel protein type 8 subunit alpha
Type:PROTEIN
Mol. Mass.:225271.59
Organism:Homo sapiens (Human)
Description:ChEMBL_1516902
Residue:1980
BDBM374015
NameBDBM374015
Synonyms:(R)-2,6-difluoro-3-methyl-4-((1-(1-phenylethyl)piperidin-4-yl)oxy)-N-(thiazol-4-yl)benzenesulfonamide 2,2,2-trifluoroacetate US10662184, Example 282 US11299490, Example 282
TypeSmall organic molecule
Emp. Form.C23H25F2N3O3S2
Mol. Mass.493.59
SMILESC[C@@H](N1CCC(CC1)Oc1cc(F)c(c(F)c1C)S(=O)(=O)Nc1cscn1)c1ccccc1