Reaction Details
TargetSodium channel protein type 8 subunit alpha
LigandBDBM374016
Substrate/Competitorn/a
Meas. Tech.Sodium Influx Assay (In Vitro Assay)
IC50 67.0±n/a nM
Citation Andrez, JBurford, KNChowdhury, SCohen, CJDehnhardt, CMDevita, RJEmpfield, JRFocken, TGrimwood, MEHasan, SAJohnson, Jr., JPZenova, AY Benzenesulfonamide compounds and their use as therapeutic agents US Patent US10246453 Publication Date 4/2/2019
 
Sodium channel protein type 8 subunit alpha
Name:Sodium channel protein type 8 subunit alpha
Type:PROTEIN
Mol. Mass.:225271.59
Organism:Homo sapiens (Human)
Description:ChEMBL_1516902
Residue:1980
BDBM374016
NameBDBM374016
Synonyms:(R)-2,6-difluoro-3-methyl-4-((1-(1-phenylethyl)piperidin-4-yl)oxy)-N-(thiazol-4-yl)benzenesulfonamide trifluoroacetic formate US10662184, Example 283 US11299490, Example 283
TypeSmall organic molecule
Emp. Form.C22H22ClF2N3O3S2
Mol. Mass.514.008
SMILESC[C@@H](N1CCC(CC1)Oc1cc(F)c(c(F)c1Cl)S(=O)(=O)Nc1cscn1)c1ccccc1