Reaction Details
TargetSodium channel protein type 8 subunit alpha
LigandBDBM374029
Substrate/Competitorn/a
Meas. Tech.Sodium Influx Assay (In Vitro Assay)
IC50 62.0±n/a nM
Citation Andrez, JBurford, KNChowdhury, SCohen, CJDehnhardt, CMDevita, RJEmpfield, JRFocken, TGrimwood, MEHasan, SAJohnson, Jr., JPZenova, AY Benzenesulfonamide compounds and their use as therapeutic agents US Patent US10246453 Publication Date 4/2/2019
 
Sodium channel protein type 8 subunit alpha
Name:Sodium channel protein type 8 subunit alpha
Type:PROTEIN
Mol. Mass.:225271.59
Organism:Homo sapiens (Human)
Description:ChEMBL_1516902
Residue:1980
BDBM374029
NameBDBM374029
Synonyms:(S)-4-((1-benzylpyrrolidin-3-yl)(methyl)amino)-2,6-difluoro-3-methyl-N-(1,2,4-thiadiazol-5-yl)benzenesulfonamide 2,2,2-trifluoroacetate US10246453, Example 297 US10815229, Example 296 | US11299490, Example 296
TypeSmall organic molecule
Emp. Form.C21H24F2N6O2S2
Mol. Mass.494.581
SMILESCN([C@H]1CCN(Cc2cccc(C)n2)C1)c1cc(F)c(c(F)c1C)S(=O)(=O)Nc1ncns1