Reaction Details
TargetHistamine H4 receptor
LigandBDBM22864
Substrate/CompetitorBDBM7966
Meas. Tech.H4R Radioligand Binding Assay
pH7.4±n/a
Temperature310.15±n/a K
Ki>10000±n/a nM
CommentsAnalysis of the [3H]histamine saturation binding yielded a Kd value of 11 +/- 1 and a Bmax value of 1.8 +/- 0.4 pmol/mg protein.
Citation Lim, HDvan Rijn, RMLing, PBakker, RAThurmond, RLLeurs, R Evaluation of histamine H1-, H2-, and H3-receptor ligands at the human histamine H4 receptor: identification of 4-methylhistamine as the first potent and selective H4 receptor agonist. J Pharmacol Exp Ther314:1310-21 (2005) 
 
Histamine H4 receptor
Name:Histamine H4 receptor
Type:G Protein-Coupled Receptor (GPCR)
Mol. Mass.:44517.02
Organism:Homo sapiens (Human)
Description:Binding assays were using CHO cells stably expressing hH4R receptors.
Residue:390
BDBM22864
BDBM7966
NameBDBM22864
Synonyms:2-[2-(3,3-diphenylpropyl)-1H-imidazol-4-yl]ethan-1-amine | Histaprodifen
TypeSmall organic molecule
Emp. Form.C20H23N3
Mol. Mass.305.4167
SMILESNCCc1cnc(CCC(c2ccccc2)c2ccccc2)[nH]1