Reaction Details
TargetDNA ligase 1
LigandBDBM23029
Substrate/CompetitorBDBM23028
Meas. Tech.FAAH Inhibition Assay
pH9±n/a
Temperature295.15±n/a K
Ki 5.1±0.6 nM
IC50 40±n/a nM
Citation Hardouin, CKelso, MJRomero, FARayl, TJLeung, DHwang, ICravatt, BFBoger, DL Structure-activity relationships of alpha-ketooxazole inhibitors of fatty acid amide hydrolase. J Med Chem50:3359-68 (2007) 
 
DNA ligase 1
Name:DNA ligase 1
Type:Enzyme
Mol. Mass.:101721.76
Organism:Homo sapiens (Human)
Description:n/a
Residue:919
BDBM23029
BDBM23028
NameBDBM23029
Synonyms:1-[5-(pyridin-2-yl)-1,3-oxazol-2-yl]-7-(thiophen-3-yl)heptan-1-one | alpha-ketooxazole, 5b
TypeSmall organic molecule
Emp. Form.C19H20N2O2S
Mol. Mass.340.439
SMILESO=C(CCCCCCc1ccsc1)c1ncc(o1)-c1ccccn1