Reaction Details
TargetDNA ligase 1
LigandBDBM23057
Substrate/CompetitorBDBM23028
Meas. Tech.FAAH Inhibition Assay
pH9±n/a
Temperature295.15±n/a K
Ki 1.5±0.1 nM
IC50 0.24±n/a nM
Citation Hardouin, CKelso, MJRomero, FARayl, TJLeung, DHwang, ICravatt, BFBoger, DL Structure-activity relationships of alpha-ketooxazole inhibitors of fatty acid amide hydrolase. J Med Chem50:3359-68 (2007) 
 
DNA ligase 1
Name:DNA ligase 1
Type:Enzyme
Mol. Mass.:101721.76
Organism:Homo sapiens (Human)
Description:n/a
Residue:919
BDBM23057
BDBM23028
NameBDBM23057
Synonyms:alpha-ketooxazole, 5cc | methyl 4-{7-oxo-7-[5-(pyridin-2-yl)-1,3-oxazol-2-yl]heptyl}benzoate
TypeSmall organic molecule
Emp. Form.C23H24N2O4
Mol. Mass.392.4477
SMILESCOC(=O)c1ccc(CCCCCCC(=O)c2ncc(o2)-c2ccccn2)cc1