Reaction Details
TargetDNA ligase 1
LigandBDBM23115
Substrate/CompetitorBDBM23028
Meas. Tech.FAAH Inhibition Assay
Temperature298.15±n/a K
Ki 14±n/a nM
Commentsextracted
Citation Hardouin, CKelso, MJRomero, FARayl, TJLeung, DHwang, ICravatt, BFBoger, DL Structure-activity relationships of alpha-ketooxazole inhibitors of fatty acid amide hydrolase. J Med Chem50:3359-68 (2007) 
 
DNA ligase 1
Name:DNA ligase 1
Type:Enzyme
Mol. Mass.:101721.76
Organism:Homo sapiens (Human)
Description:n/a
Residue:919
BDBM23115
BDBM23028
NameBDBM23115
Synonyms:6-phenoxy-1-[5-(pyridin-2-yl)-1,3-oxazol-2-yl]hexan-1-one | alpha-ketooxazole, 12n
TypeSmall organic molecule
Emp. Form.C20H20N2O3
Mol. Mass.336.3844
SMILESO=C(CCCCCOc1ccccc1)c1ncc(o1)-c1ccccn1