Reaction Details
TargetDNA ligase 1
LigandBDBM23117
Substrate/CompetitorBDBM23028
Meas. Tech.FAAH Inhibition Assay
Temperature298.15±n/a K
Ki 3±n/a nM
Commentsextracted
Citation Hardouin, CKelso, MJRomero, FARayl, TJLeung, DHwang, ICravatt, BFBoger, DL Structure-activity relationships of alpha-ketooxazole inhibitors of fatty acid amide hydrolase. J Med Chem50:3359-68 (2007) 
 
DNA ligase 1
Name:DNA ligase 1
Type:Enzyme
Mol. Mass.:101721.76
Organism:Homo sapiens (Human)
Description:n/a
Residue:919
BDBM23117
BDBM23028
NameBDBM23117
Synonyms:6-(phenylsulfanyl)-1-[5-(pyridin-2-yl)-1,3-oxazol-2-yl]hexan-1-one | alpha-ketooxazole, 12p
TypeSmall organic molecule
Emp. Form.C20H20N2O2S
Mol. Mass.352.45
SMILESO=C(CCCCCSc1ccccc1)c1ncc(o1)-c1ccccn1