Reaction Details
TargetDNA ligase 1
LigandBDBM23118
Substrate/CompetitorBDBM23028
Meas. Tech.FAAH Inhibition Assay
Temperature298.15±n/a K
Ki 1000±n/a nM
Commentsextracted
Citation Hardouin, CKelso, MJRomero, FARayl, TJLeung, DHwang, ICravatt, BFBoger, DL Structure-activity relationships of alpha-ketooxazole inhibitors of fatty acid amide hydrolase. J Med Chem50:3359-68 (2007) 
 
DNA ligase 1
Name:DNA ligase 1
Type:Enzyme
Mol. Mass.:101721.76
Organism:Homo sapiens (Human)
Description:n/a
Residue:919
BDBM23118
BDBM23028
NameBDBM23118
Synonyms:6-(benzenesulfinyl)-1-[5-(pyridin-2-yl)-1,3-oxazol-2-yl]hexan-1-one | alpha-ketooxazole, 12q
TypeSmall organic molecule
Emp. Form.C20H20N2O3S
Mol. Mass.368.449
SMILESO=C(CCCCCS(=O)c1ccccc1)c1ncc(o1)-c1ccccn1