Reaction Details
TargetDNA ligase 1
LigandBDBM23128
Substrate/CompetitorBDBM23028
Meas. Tech.FAAH Inhibition Assay
Temperature298.15±n/a K
Ki 200±n/a nM
Commentsextracted
Citation Hardouin, CKelso, MJRomero, FARayl, TJLeung, DHwang, ICravatt, BFBoger, DL Structure-activity relationships of alpha-ketooxazole inhibitors of fatty acid amide hydrolase. J Med Chem50:3359-68 (2007) 
 
DNA ligase 1
Name:DNA ligase 1
Type:Enzyme
Mol. Mass.:101721.76
Organism:Homo sapiens (Human)
Description:n/a
Residue:919
BDBM23128
BDBM23028
NameBDBM23128
Synonyms:6-hydroxy-7-phenyl-1-[5-(pyridin-2-yl)-1,3-oxazol-2-yl]heptan-1-one | alpha-ketooxazole, 13h
TypeSmall organic molecule
Emp. Form.C21H22N2O3
Mol. Mass.350.411
SMILESOC(CCCCC(=O)c1ncc(o1)-c1ccccn1)Cc1ccccc1