Reaction Details
TargetDNA ligase 1
LigandBDBM23133
Substrate/CompetitorBDBM23028
Meas. Tech.FAAH Inhibition Assay
Temperature298.15±n/a K
Ki>50000±n/a nM
Commentsextracted
Citation Hardouin, CKelso, MJRomero, FARayl, TJLeung, DHwang, ICravatt, BFBoger, DL Structure-activity relationships of alpha-ketooxazole inhibitors of fatty acid amide hydrolase. J Med Chem50:3359-68 (2007) 
 
DNA ligase 1
Name:DNA ligase 1
Type:Enzyme
Mol. Mass.:101721.76
Organism:Homo sapiens (Human)
Description:n/a
Residue:919
BDBM23133
BDBM23028
NameBDBM23133
Synonyms:2-cyclopropanecarbonyl-5-(pyridin-2-yl)-1,3-oxazole | alpha-ketooxazole, 14d
TypeSmall organic molecule
Emp. Form.C12H10N2O2
Mol. Mass.214.22
SMILESO=C(C1CC1)c1ncc(o1)-c1ccccn1