Reaction Details
TargetFatty-acid amide hydrolase 1
LigandBDBM23078
Substrate/CompetitorBDBM23028
Meas. Tech.FAAH Inhibition Assay
Temperature298.15±n/a K
Ki 2.9±n/a nM
Commentsextracted
Citation Hardouin, CKelso, MJRomero, FARayl, TJLeung, DHwang, ICravatt, BFBoger, DL Structure-activity relationships of alpha-ketooxazole inhibitors of fatty acid amide hydrolase. J Med Chem50:3359-68 (2007) 
 
Fatty-acid amide hydrolase 1
Name:Fatty-acid amide hydrolase 1
Type:Protein
Mol. Mass.:63071.19
Organism:Homo sapiens (Human)
Description:O00519
Residue:579
BDBM23078
BDBM23028
NameBDBM23078
Synonyms:3-(4-phenylphenyl)-1-[5-(pyridin-2-yl)-1,3-oxazol-2-yl]propan-1-one alpha-ketooxazole, 11j
TypeSmall organic molecule
Emp. Form.C23H18N2O2
Mol. Mass.354.4012
SMILESO=C(CCc1ccc(cc1)-c1ccccc1)c1ncc(o1)-c1ccccn1