Reaction Details
TargetCarboxylic ester hydrolase
LigandBDBM23053
Substrate/CompetitorBDBM23139
Meas. Tech.FAAH Inhibition Assay
Temperature298.15±n/a K
IC50 200±n/a nM
Commentsextracted
Citation Hardouin, CKelso, MJRomero, FARayl, TJLeung, DHwang, ICravatt, BFBoger, DL Structure-activity relationships of alpha-ketooxazole inhibitors of fatty acid amide hydrolase. J Med Chem50:3359-68 (2007) 
 
Carboxylic ester hydrolase
Name:Carboxylic ester hydrolase
Type:Homotrimer; type-B carboxylesterase/lipase family
Mol. Mass.:61960.20
Organism:Homo sapiens (Human)
Description:Q8TDZ9
Residue:565
BDBM23053
BDBM23139
NameBDBM23053
Synonyms:1-[5-(pyridin-2-yl)-1,3-oxazol-2-yl]-7-[3-(trifluoromethyl)phenyl]heptan-1-one | alpha-ketooxazole, 5y
TypeSmall organic molecule
Emp. Form.C22H21F3N2O2
Mol. Mass.402.4095
SMILESFC(F)(F)c1cccc(CCCCCCC(=O)c2ncc(o2)-c2ccccn2)c1