Reaction Details
TargetCarboxylic ester hydrolase
LigandBDBM23066
Substrate/CompetitorBDBM23139
Meas. Tech.FAAH Inhibition Assay
Temperature298.15±n/a K
IC50 2000±n/a nM
Commentsextracted
Citation Hardouin, CKelso, MJRomero, FARayl, TJLeung, DHwang, ICravatt, BFBoger, DL Structure-activity relationships of alpha-ketooxazole inhibitors of fatty acid amide hydrolase. J Med Chem50:3359-68 (2007) 
 
Carboxylic ester hydrolase
Name:Carboxylic ester hydrolase
Type:Homotrimer; type-B carboxylesterase/lipase family
Mol. Mass.:61960.20
Organism:Homo sapiens (Human)
Description:Q8TDZ9
Residue:565
BDBM23066
BDBM23139
NameBDBM23066
Synonyms:7-(4-methanesulfonylphenyl)-1-[5-(pyridin-2-yl)-1,3-oxazol-2-yl]heptan-1-one | alpha-ketooxazole, 5mm
TypeSmall organic molecule
Emp. Form.C22H24N2O4S
Mol. Mass.412.502
SMILESCS(=O)(=O)c1ccc(CCCCCCC(=O)c2ncc(o2)-c2ccccn2)cc1