Reaction Details
TargetCarboxylic ester hydrolase
LigandBDBM23075
Substrate/CompetitorBDBM23139
Meas. Tech.FAAH Inhibition Assay
Temperature298.15±n/a K
IC50 600±n/a nM
Commentsextracted
Citation Hardouin, CKelso, MJRomero, FARayl, TJLeung, DHwang, ICravatt, BFBoger, DL Structure-activity relationships of alpha-ketooxazole inhibitors of fatty acid amide hydrolase. J Med Chem50:3359-68 (2007) 
 
Carboxylic ester hydrolase
Name:Carboxylic ester hydrolase
Type:Homotrimer; type-B carboxylesterase/lipase family
Mol. Mass.:61960.20
Organism:Homo sapiens (Human)
Description:Q8TDZ9
Residue:565
BDBM23075
BDBM23139
NameBDBM23075
Synonyms:3-[4-(phenylamino)phenyl]-1-[5-(pyridin-2-yl)-1,3-oxazol-2-yl]propan-1-one | alpha-ketooxazole, 11g
TypeSmall organic molecule
Emp. Form.C23H19N3O2
Mol. Mass.369.4159
SMILESO=C(CCc1ccc(Nc2ccccc2)cc1)c1ncc(o1)-c1ccccn1