Reaction Details
TargetPeptidyl-prolyl cis-trans isomerase FKBP1A
LigandBDBM23325
Substrate/CompetitorBDBM23318
Meas. Tech.Peptidyl Prolyl Isomerase (PPIase) Inibition Assay
pH8±n/a
Temperature273.15±n/a K
Ki 210±n/a nM
Km520000±80000 nM
kcat344±26 1/sec
Citation Wu, YQWilkinson, DELimburg, DLi, JHSauer, HRoss, DLiang, SSpicer, DValentine, HFuller, MGuo, HHoworth, PSoni, RChen, YSteiner, JPHamilton, GS Synthesis of ketone analogues of prolyl and pipecolyl ester FKBP12 ligands. J Med Chem45:3558-68 (2002) 
 
Peptidyl-prolyl cis-trans isomerase FKBP1A
Name:Peptidyl-prolyl cis-trans isomerase FKBP1A
Type:Isomerase
Mol. Mass.:11911.51
Organism:Bos taurus (bovine)
Description:The enzyme was purified from calf thymus. The collected protein was further applied to Sephacryl column, and the fraction contained high PPIase activity was pooled.
Residue:108
BDBM23325
BDBM23318
NameBDBM23325
Synonyms:3,3-dimethyl-1-[(2S)-2-[5-(pyridin-3-yl)pentanoyl]pyrrolidin-1-yl]pentane-1,2-dione | N-Glyoxylprolyl ketone, 5h
TypeSmall organic molecule
Emp. Form.C21H30N2O3
Mol. Mass.358.4745
SMILESCCC(C)(C)C(=O)C(=O)N1CCC[C@H]1C(=O)CCCCc1cccnc1