Reaction Details
TargetPeptidyl-prolyl cis-trans isomerase FKBP1A
LigandBDBM23328
Substrate/CompetitorBDBM23318
Meas. Tech.Peptidyl Prolyl Isomerase (PPIase) Inibition Assay
pH8±n/a
Temperature273.15±n/a K
Ki 3400±n/a nM
Km520000±80000 nM
kcat344±26 1/sec
Citation Wu, YQWilkinson, DELimburg, DLi, JHSauer, HRoss, DLiang, SSpicer, DValentine, HFuller, MGuo, HHoworth, PSoni, RChen, YSteiner, JPHamilton, GS Synthesis of ketone analogues of prolyl and pipecolyl ester FKBP12 ligands. J Med Chem45:3558-68 (2002) 
 
Peptidyl-prolyl cis-trans isomerase FKBP1A
Name:Peptidyl-prolyl cis-trans isomerase FKBP1A
Type:Isomerase
Mol. Mass.:11911.51
Organism:Bos taurus (bovine)
Description:The enzyme was purified from calf thymus. The collected protein was further applied to Sephacryl column, and the fraction contained high PPIase activity was pooled.
Residue:108
BDBM23328
BDBM23318
NameBDBM23328
Synonyms:3,3-dimethyl-1-[(2S)-2-pentanoylpiperidin-1-yl]pentane-1,2-dione | Pipecolyl ketone, 11a
TypeSmall organic molecule
Emp. Form.C17H29NO3
Mol. Mass.295.4171
SMILESCCCCC(=O)[C@@H]1CCCCN1C(=O)C(=O)C(C)(C)CC