Reaction Details
TargetPeptidyl-prolyl cis-trans isomerase FKBP1A
LigandBDBM23374
Substrate/CompetitorBDBM23318
Meas. Tech.Peptidyl Prolyl Isomerase (PPIase) Inibition Assay
Ki 84±n/a nM
Citation Hudack, RABarta, NSGuo, CDeal, JDong, LFay, LKCaprathe, BChatterjee, AVanderpool, DBigge, CShowalter, RBender, SAugelli-Szafran, CELunney, EHou, X Design, synthesis, and biological activity of novel polycyclic aza-amide FKBP12 ligands. J Med Chem49:1202-6 (2006) 
 
Peptidyl-prolyl cis-trans isomerase FKBP1A
Name:Peptidyl-prolyl cis-trans isomerase FKBP1A
Type:Isomerase
Mol. Mass.:11911.51
Organism:Bos taurus (bovine)
Description:The enzyme was purified from calf thymus. The collected protein was further applied to Sephacryl column, and the fraction contained high PPIase activity was pooled.
Residue:108
BDBM23374
BDBM23318
NameBDBM23374
Synonyms:4,6-dimethoxy-17-[(4-methylbenzene)sulfonyl]-11,17-diazatetracyclo[11.3.1.0^{2,11}.0^{3,8}]heptadeca-3(8),4,6-trien-12-one | Tetracyclic aza-amide, 12c
TypeSmall organic molecule
Emp. Form.C24H28N2O5S
Mol. Mass.456.555
SMILESCOc1cc2CCN3C(C4CCCC(N4S(=O)(=O)c4ccc(C)cc4)C3=O)c2c(OC)c1