Reaction Details
TargetPeptidyl-prolyl cis-trans isomerase FKBP1A
LigandBDBM23386
Substrate/CompetitorBDBM23318
Meas. Tech.Peptidyl Prolyl Isomerase (PPIase) Inibition Assay
Ki 7000±n/a nM
Citation Hudack, RABarta, NSGuo, CDeal, JDong, LFay, LKCaprathe, BChatterjee, AVanderpool, DBigge, CShowalter, RBender, SAugelli-Szafran, CELunney, EHou, X Design, synthesis, and biological activity of novel polycyclic aza-amide FKBP12 ligands. J Med Chem49:1202-6 (2006) 
 
Peptidyl-prolyl cis-trans isomerase FKBP1A
Name:Peptidyl-prolyl cis-trans isomerase FKBP1A
Type:Isomerase
Mol. Mass.:11911.51
Organism:Bos taurus (bovine)
Description:The enzyme was purified from calf thymus. The collected protein was further applied to Sephacryl column, and the fraction contained high PPIase activity was pooled.
Residue:108
BDBM23386
BDBM23318
NameBDBM23386
Synonyms:N-(2,4-difluorophenyl)-4,6-dimethoxy-12-oxo-11,17-diazatetracyclo[11.3.1.0^{2,11}.0^{3,8}]heptadeca-3(8),4,6-triene-17-carboxamide | Tetracyclic aza-amide, 13e
TypeSmall organic molecule
Emp. Form.C24H25F2N3O4
Mol. Mass.457.4698
SMILESCOc1cc2CCN3C(C4CCCC(N4C(=O)Nc4ccc(F)cc4F)C3=O)c2c(OC)c1