Reaction Details
Target3-oxoacyl-[acyl-carrier-protein] synthase 3
LigandBDBM23576
Substrate/CompetitorBDBM3158
Meas. Tech.FabD/FabH Coupled Assay
pH7±n/a
Temperature295.15±n/a K
IC50 2200±n/a nM
Citation Nie, ZPerretta, CLu, JSu, YMargosiak, SGajiwala, KSCortez, JNikulin, VYager, KMAppelt, KChu, S Structure-based design, synthesis, and study of potent inhibitors of beta-ketoacyl-acyl carrier protein synthase III as potential antimicrobial agents. J Med Chem48:1596-609 (2005) 
 
3-oxoacyl-[acyl-carrier-protein] synthase 3
Name:3-oxoacyl-[acyl-carrier-protein] synthase 3
Type:Acyltransferase; homodimer
Mol. Mass.:35176.53
Organism:Enterococcus faecalis
Description:The E. faecalis FabH was cloned, and protein was expressed in E. coli.
Residue:321
BDBM23576
BDBM3158
NameBDBM23576
Synonyms:2-{[3-(diethylsulfamoyl)-4-(piperidin-1-yl)benzene]amido}benzoic acid | Diethylsulfonamide Derivative, 13f
TypeSmall organic molecule
Emp. Form.C23H29N3O5S
Mol. Mass.459.558
SMILESCCN(CC)S(=O)(=O)c1cc(ccc1N1CCCCC1)C(=O)Nc1ccccc1C(O)=O