Reaction Details
Target3-oxoacyl-[acyl-carrier-protein] synthase 3
LigandBDBM23587
Substrate/CompetitorBDBM3158
Meas. Tech.FabD/FabH Coupled Assay
pH7±n/a
Temperature295.15±n/a K
IC50 4±n/a nM
Citation Nie, ZPerretta, CLu, JSu, YMargosiak, SGajiwala, KSCortez, JNikulin, VYager, KMAppelt, KChu, S Structure-based design, synthesis, and study of potent inhibitors of beta-ketoacyl-acyl carrier protein synthase III as potential antimicrobial agents. J Med Chem48:1596-609 (2005) 
 
3-oxoacyl-[acyl-carrier-protein] synthase 3
Name:3-oxoacyl-[acyl-carrier-protein] synthase 3
Type:Acyltransferase; homodimer
Mol. Mass.:34846.68
Organism:Streptococcus pyogenes
Description:The S. pyogenes FabH was cloned, and protein was expressed in E. coli.
Residue:324
BDBM23587
BDBM3158
NameBDBM23587
Synonyms:(3-Phenoxybenzoylamino)benzoic acid deriv., 33 | 2-hydroxy-6-[(3-phenoxy-4-phenylbenzene)amido]benzoic acid
TypeSmall organic molecule
Emp. Form.C26H19NO5
Mol. Mass.425.4328
SMILESOC(=O)c1c(O)cccc1NC(=O)c1ccc(c(Oc2ccccc2)c1)-c1ccccc1