Reaction Details
Target3-oxoacyl-[acyl-carrier-protein] synthase 3
LigandBDBM23584
Substrate/CompetitorBDBM3158
Meas. Tech.FabD/FabH Coupled Assay
pH7±n/a
Temperature295.15±n/a K
IC50 10000±n/a nM
Citation Nie, ZPerretta, CLu, JSu, YMargosiak, SGajiwala, KSCortez, JNikulin, VYager, KMAppelt, KChu, S Structure-based design, synthesis, and study of potent inhibitors of beta-ketoacyl-acyl carrier protein synthase III as potential antimicrobial agents. J Med Chem48:1596-609 (2005) 
 
3-oxoacyl-[acyl-carrier-protein] synthase 3
Name:3-oxoacyl-[acyl-carrier-protein] synthase 3
Type:Acyltransferase; homodimer
Mol. Mass.:33869.00
Organism:Staphylococcus aureus
Description:The S. aureus FabH was cloned, and protein was expressed in E. coli.
Residue:313
BDBM23584
BDBM3158
NameBDBM23584
Synonyms:(3-Phenoxybenzoylamino)benzoic acid deriv., 24c | 2-[(3-phenoxy-4-phenylbenzene)amido]benzoic acid
TypeSmall organic molecule
Emp. Form.C26H19NO4
Mol. Mass.409.4334
SMILESOC(=O)c1ccccc1NC(=O)c1ccc(c(Oc2ccccc2)c1)-c1ccccc1