Reaction Details
Target3-oxoacyl-[acyl-carrier-protein] synthase 3
LigandBDBM23586
Substrate/CompetitorBDBM3158
Meas. Tech.FabD/FabH Coupled Assay
pH7±n/a
Temperature295.15±n/a K
IC50 20000±n/a nM
Citation Nie, ZPerretta, CLu, JSu, YMargosiak, SGajiwala, KSCortez, JNikulin, VYager, KMAppelt, KChu, S Structure-based design, synthesis, and study of potent inhibitors of beta-ketoacyl-acyl carrier protein synthase III as potential antimicrobial agents. J Med Chem48:1596-609 (2005) 
 
3-oxoacyl-[acyl-carrier-protein] synthase 3
Name:3-oxoacyl-[acyl-carrier-protein] synthase 3
Type:Acyltransferase; homodimer
Mol. Mass.:34269.34
Organism:Haemophilus influenzae
Description:The H. influenzae FabH was cloned, and protein was expressed in E. coli.
Residue:316
BDBM23586
BDBM3158
NameBDBM23586
Synonyms:(3-Phenoxybenzoylamino)benzoic acid deriv., 31 | 2-[(4-bromo-3-phenoxybenzene)amido]-6-hydroxybenzoic acid
TypeSmall organic molecule
Emp. Form.C20H14BrNO5
Mol. Mass.428.233
SMILESOC(=O)c1c(O)cccc1NC(=O)c1ccc(Br)c(Oc2ccccc2)c1