Reaction Details
Target3-oxoacyl-[acyl-carrier-protein] synthase 3
LigandBDBM23599
Substrate/CompetitorBDBM3158
Meas. Tech.FabD/FabH Coupled Assay
IC50 220±n/a nM
Citation Nie, ZPerretta, CLu, JSu, YMargosiak, SGajiwala, KSCortez, JNikulin, VYager, KMAppelt, KChu, S Structure-based design, synthesis, and study of potent inhibitors of beta-ketoacyl-acyl carrier protein synthase III as potential antimicrobial agents. J Med Chem48:1596-609 (2005) 
 
3-oxoacyl-[acyl-carrier-protein] synthase 3
Name:3-oxoacyl-[acyl-carrier-protein] synthase 3
Type:Acyltransferase; homodimer
Mol. Mass.:35176.53
Organism:Enterococcus faecalis
Description:The E. faecalis FabH was cloned, and protein was expressed in E. coli.
Residue:321
BDBM23599
BDBM3158
NameBDBM23599
Synonyms:(3-Phenoxybenzoylamino)benzoic acid deriv., 24h | 2-{[4-(4-ethoxyphenyl)-3-phenoxybenzene]amido}benzoic acid
TypeSmall organic molecule
Emp. Form.C28H23NO5
Mol. Mass.453.4859
SMILESCCOc1ccc(cc1)-c1ccc(cc1Oc1ccccc1)C(=O)Nc1ccccc1C(O)=O